Reaction Details
TargetPannexin-1
LigandBDBM50485599
Substrate/Competitorn/a
Meas. Tech.ChEMBL_2122674 (CHEMBL4831907)
IC50 50000±n/a nM
Citation Crocetti, LGuerrini, GPuglioli, SGiovannoni, MPDi Cesare Mannelli, LLucarini, EGhelardini, CWang, JDahl, G Design and synthesis of the first indole-based blockers of Panx-1 channel. Eur J Med Chem223:0 (2021) 
 
Pannexin-1
Name:Pannexin-1
Type:PROTEIN
Mol. Mass.:48168.73
Organism:Mus musculus
Description:ChEMBL_120484
Residue:426
BDBM50485599
NameBDBM50485599
Synonyms:5-NITRO-2-PHENYLPROPYLAMINOBENZOIC ACID [NPPB] | CHEBI:34457
TypeSmall organic molecule
Emp. Form.C16H16N2O4
Mol. Mass.300.3092
SMILESOC(=O)c1cc(ccc1NCCCc1ccccc1)[N+]([O-])=O