Reaction Details
TargetPotassium voltage-gated channel subfamily H member 2
LigandBDBM50140518
Substrate/Competitorn/a
Meas. Tech.ChEBML_65269
Ki 42000±n/a nM
Citation Caldwell, CGChen, PHe, JParmee, ERLeiting, BMarsilio, FPatel, RAWu, JKEiermann, GJPetrov, AHe, HLyons, KAThornberry, NAWeber, AE Fluoropyrrolidine amides as dipeptidyl peptidase IV inhibitors. Bioorg Med Chem Lett14:1265-8 (2004) 
 
Potassium voltage-gated channel subfamily H member 2
Name:Potassium voltage-gated channel subfamily H member 2
Type:Multi-pass membrane protein
Mol. Mass.:126672.65
Organism:Homo sapiens (Human)
Description:Q12809
Residue:1159
BDBM50140518
NameBDBM50140518
Synonyms:CHEMBL279944 | {4-[(S)-1-Amino-2-(3,3-difluoro-pyrrolidin-1-yl)-2-oxo-ethyl]-cyclohexyl}-carbamic acid benzyl ester
TypeSmall organic molecule
Emp. Form.C20H27F2N3O3
Mol. Mass.395.4435
SMILESN[C@@H]([C@H]1CC[C@@H](CC1)NC(=O)OCc1ccccc1)C(=O)N1CCC(F)(F)C1