Reaction Details
TargetDipeptidyl peptidase 4
LigandBDBM50140530
Substrate/Competitorn/a
Meas. Tech.ChEBML_53340
IC50 21±n/a nM
Citation Caldwell, CGChen, PHe, JParmee, ERLeiting, BMarsilio, FPatel, RAWu, JKEiermann, GJPetrov, AHe, HLyons, KAThornberry, NAWeber, AE Fluoropyrrolidine amides as dipeptidyl peptidase IV inhibitors. Bioorg Med Chem Lett14:1265-8 (2004) 
 
Dipeptidyl peptidase 4
Name:Dipeptidyl peptidase 4
Type:Enzyme
Mol. Mass.:88271.01
Organism:Homo sapiens (Human)
Description:P27487
Residue:766
BDBM50140530
NameBDBM50140530
Synonyms:CHEMBL22294 | N-{4-[(S)-1-Amino-2-(3,3-difluoro-pyrrolidin-1-yl)-2-oxo-ethyl]-cyclohexyl}-2,4-difluoro-benzenesulfonamide
TypeSmall organic molecule
Emp. Form.C18H23F4N3O3S
Mol. Mass.437.452
SMILESN[C@@H]([C@H]1CC[C@@H](CC1)NS(=O)(=O)c1ccc(F)cc1F)C(=O)N1CCC(F)(F)C1