Reaction Details
TargetDipeptidyl peptidase 4
LigandBDBM11463
Substrate/Competitorn/a
Meas. Tech.ChEBML_53340
IC50 48±n/a nM
Citation Caldwell, CGChen, PHe, JParmee, ERLeiting, BMarsilio, FPatel, RAWu, JKEiermann, GJPetrov, AHe, HLyons, KAThornberry, NAWeber, AE Fluoropyrrolidine amides as dipeptidyl peptidase IV inhibitors. Bioorg Med Chem Lett14:1265-8 (2004) 
 
Dipeptidyl peptidase 4
Name:Dipeptidyl peptidase 4
Type:Enzyme
Mol. Mass.:88271.01
Organism:Homo sapiens (Human)
Description:P27487
Residue:766
BDBM11463
NameBDBM11463
Synonyms:CHEMBL22310 difluorobenzenesulfonamide 1
TypeSmall organic molecule
Emp. Form.C18H24F3N3O3S
Mol. Mass.419.462
SMILES[H][C@@]1(CC[C@@H](CC1)NS(=O)(=O)c1ccc(F)cc1F)[C@H](N)C(=O)N1CC[C@H](F)C1