Reaction Details
TargetDipeptidyl peptidase 2
LigandBDBM50140521
Substrate/Competitorn/a
Meas. Tech.ChEBML_160555
IC50 8800±n/a nM
Citation Caldwell, CGChen, PHe, JParmee, ERLeiting, BMarsilio, FPatel, RAWu, JKEiermann, GJPetrov, AHe, HLyons, KAThornberry, NAWeber, AE Fluoropyrrolidine amides as dipeptidyl peptidase IV inhibitors. Bioorg Med Chem Lett14:1265-8 (2004) 
 
Dipeptidyl peptidase 2
Name:Dipeptidyl peptidase 2
Type:Protein
Mol. Mass.:54339.29
Organism:Homo sapiens (Human)
Description:Q9UHL4
Residue:492
BDBM50140521
NameBDBM50140521
Synonyms:CHEMBL25437 | N-[4-((S)-1-Amino-2-oxo-2-pyrrolidin-1-yl-ethyl)-cyclohexyl]-2,4-difluoro-benzenesulfonamide
TypeSmall organic molecule
Emp. Form.C18H25F2N3O3S
Mol. Mass.401.471
SMILESN[C@@H]([C@H]1CC[C@@H](CC1)NS(=O)(=O)c1ccc(F)cc1F)C(=O)N1CCCC1