Reaction Details
TargetDipeptidyl peptidase 4
LigandBDBM50140539
Substrate/Competitorn/a
Meas. Tech.ChEBML_53340
IC50 340±n/a nM
Citation Caldwell, CGChen, PHe, JParmee, ERLeiting, BMarsilio, FPatel, RAWu, JKEiermann, GJPetrov, AHe, HLyons, KAThornberry, NAWeber, AE Fluoropyrrolidine amides as dipeptidyl peptidase IV inhibitors. Bioorg Med Chem Lett14:1265-8 (2004) 
 
Dipeptidyl peptidase 4
Name:Dipeptidyl peptidase 4
Type:Enzyme
Mol. Mass.:88271.01
Organism:Homo sapiens (Human)
Description:P27487
Residue:766
BDBM50140539
NameBDBM50140539
Synonyms:(S)-2-Amino-2-cyclohexyl-1-((R)-3-fluoro-pyrrolidin-1-yl)-ethanone | CHEMBL23981
TypeSmall organic molecule
Emp. Form.C12H21FN2O
Mol. Mass.228.3063
SMILESN[C@@H](C1CCCCC1)C(=O)N1CC[C@@H](F)C1