Reaction Details
TargetPotassium voltage-gated channel subfamily H member 2
LigandBDBM50140533
Substrate/Competitorn/a
Meas. Tech.ChEBML_65269
Ki 2800±n/a nM
Citation Caldwell, CGChen, PHe, JParmee, ERLeiting, BMarsilio, FPatel, RAWu, JKEiermann, GJPetrov, AHe, HLyons, KAThornberry, NAWeber, AE Fluoropyrrolidine amides as dipeptidyl peptidase IV inhibitors. Bioorg Med Chem Lett14:1265-8 (2004) 
 
Potassium voltage-gated channel subfamily H member 2
Name:Potassium voltage-gated channel subfamily H member 2
Type:Multi-pass membrane protein
Mol. Mass.:126672.65
Organism:Homo sapiens (Human)
Description:Q12809
Residue:1159
BDBM50140533
NameBDBM50140533
Synonyms:CHEMBL25211 | N-[4-((S)-1-Amino-2-oxo-2-thiazolidin-3-yl-ethyl)-cyclohexyl]-4-trifluoromethoxy-benzenesulfonamide
TypeSmall organic molecule
Emp. Form.C18H24F3N3O4S2
Mol. Mass.467.526
SMILESN[C@@H]([C@H]1CC[C@@H](CC1)NS(=O)(=O)c1ccc(OC(F)(F)F)cc1)C(=O)N1CCSC1