Reaction Details
TargetDipeptidyl peptidase 4
LigandBDBM50140538
Substrate/Competitorn/a
Meas. Tech.ChEBML_53340
IC50 89±n/a nM
Citation Caldwell, CGChen, PHe, JParmee, ERLeiting, BMarsilio, FPatel, RAWu, JKEiermann, GJPetrov, AHe, HLyons, KAThornberry, NAWeber, AE Fluoropyrrolidine amides as dipeptidyl peptidase IV inhibitors. Bioorg Med Chem Lett14:1265-8 (2004) 
 
Dipeptidyl peptidase 4
Name:Dipeptidyl peptidase 4
Type:Enzyme
Mol. Mass.:88271.01
Organism:Homo sapiens (Human)
Description:P27487
Residue:766
BDBM50140538
NameBDBM50140538
Synonyms:CHEMBL23979 | N-[4-((S)-1-Amino-2-oxo-2-pyrrolidin-1-yl-ethyl)-cyclohexyl]-4-trifluoromethoxy-benzenesulfonamide
TypeSmall organic molecule
Emp. Form.C19H26F3N3O4S
Mol. Mass.449.488
SMILESN[C@@H]([C@H]1CC[C@@H](CC1)NS(=O)(=O)c1ccc(OC(F)(F)F)cc1)C(=O)N1CCCC1