Reaction Details
TargetC-X-C chemokine receptor type 2
LigandBDBM50140793
Substrate/Competitorn/a
Meas. Tech.ChEMBL_44678 (CHEMBL656551)
IC50 860±n/a nM
Citation Widdowson, KLElliott, JDVeber, DFNie, HRutledge, MCMcCleland, BWXiang, JNJurewicz, AJHertzberg, RPFoley, JJGriswold, DEMartin, LLee, JMWhite, JRSarau, HM Evaluation of potent and selective small-molecule antagonists for the CXCR2 chemokine receptor. J Med Chem47:1319-21 (2004) 
 
C-X-C chemokine receptor type 2
Name:C-X-C chemokine receptor type 2
Type:Protein
Mol. Mass.:40767.88
Organism:Homo sapiens (Human)
Description:P25025
Residue:360
BDBM50140793
NameBDBM50140793
Synonyms:1-(2-Hydroxy-3-nitro-phenyl)-3-phenyl-urea | CHEMBL283736
TypeSmall organic molecule
Emp. Form.C13H11N3O4
Mol. Mass.273.2441
SMILESOc1c(NC(=O)Nc2ccccc2)cccc1[N+]([O-])=O