Reaction Details
TargetHistone deacetylase 2b
LigandBDBM19130
Substrate/Competitorn/a
Meas. Tech.ChEMBL_87886 (CHEMBL698804)
IC50 7.2±n/a nM
Citation Ragno, RMai, AMassa, SCerbara, IValente, SBottoni, PScatena, RJesacher, FLoidl, PBrosch, G 3-(4-Aroyl-1-methyl-1H-pyrrol-2-yl)-N-hydroxy-2-propenamides as a new class of synthetic histone deacetylase inhibitors. 3. Discovery of novel lead compounds through structure-based drug design and docking studies. J Med Chem47:1351-9 (2004) 
 
Histone deacetylase 2b
Name:Histone deacetylase 2b
Synonyms:Histone deacetylase HD2
Type:PROTEIN
Mol. Mass.:30785.07
Organism:Zea mays
Description:ChEMBL_87549
Residue:286
BDBM19130
NameBDBM19130
TypeSmall organic molecule
Emp. Form.C17H22N2O3
Mol. Mass.302.3682
SMILESCC(C=CC(=O)NO)C=C(C)C(=O)c1ccc(cc1)N(C)C