Reaction Details
TargetType-2 angiotensin II receptor
LigandBDBM50141044
Substrate/Competitorn/a
Meas. Tech.ChEMBL_35278 (CHEMBL648317)
Ki 4.6±n/a nM
Citation Wan, YWallinder, CJohansson, BHolm, MMahalingam, AKWu, XBotros, MKarlén, APettersson, ANyberg, FFändriks, LHallberg, AAlterman, M First reported nonpeptide AT1 receptor agonist (L-162,313) acts as an AT2 receptor agonist in vivo. J Med Chem47:1536-46 (2004) 
 
Type-2 angiotensin II receptor
Name:Type-2 angiotensin II receptor
Type:Enzyme Catalytic Domain
Mol. Mass.:41201.61
Organism:Homo sapiens (Human)
Description:Angiotensin II, central 0 0::P50052
Residue:363
BDBM50141044
NameBDBM50141044
Synonyms:CHEMBL291124 | N-Butyloxycarbonyl-5-isobutyl-3-{4-[6-(N-acetyl-ethylamino)-4-oxo-2-propyl-4H-quinazolin-3-ylmethyl]phenyl}-thiophene-2-sulfonamide
TypeSmall organic molecule
Emp. Form.C35H44N4O6S2
Mol. Mass.680.877
SMILESCCCCOC(=O)NS(=O)(=O)c1sc(CC(C)C)cc1-c1ccc(Cn2c(CCC)nc3ccc(cc3c2=O)N(CC)C(C)=O)cc1