Reaction Details
TargetBcl-2-like protein 1
LigandBDBM31378
Substrate/Competitorn/a
Meas. Tech.ChEBML_38726
Ki 1852±n/a nM
Citation Yin, HHamilton, AD Terephthalamide derivatives as mimetics of the helical region of Bak peptide target Bcl-xL protein. Bioorg Med Chem Lett14:1375-9 (2004) 
 
Bcl-2-like protein 1
Name:Bcl-2-like protein 1
Type:Mitochondrion membrane; Single-pass membrane protein
Mol. Mass.:26039.60
Organism:Homo sapiens (Human)
Description:n/a
Residue:233
BDBM31378
NameBDBM31378
Synonyms:CHEMBL284686 | terephthalamide scaffold, 26
TypeSmall organic molecule
Emp. Form.C22H34N2O5
Mol. Mass.406.5158
SMILESCOC(=O)[C@H](CC(C)C)NC(=O)c1ccc(cc1OC)C(=O)N(C(C)C)C(C)C