Reaction Details
TargetGenome polyprotein/Non-structural protein 4A
LigandBDBM50141196
Substrate/Competitorn/a
Meas. Tech.ChEMBL_143644 (CHEMBL752803)
Ki<200±n/a nM
Citation Perni, RBPitlik, JBritt, SDCourt, JJCourtney, LFDeininger, DDFarmer, LJGates, CAHarbeson, SLLevin, RBLin, CLin, KMoon, YCLuong, YPO'Malley, ETRao, BGThomson, JATung, RDVan Drie, JHWei, Y Inhibitors of hepatitis C virus NS3.4A protease 2. Warhead SAR and optimization. Bioorg Med Chem Lett14:1441-6 (2004) 
 
Genome polyprotein/Non-structural protein 4A
Name:Genome polyprotein/Non-structural protein 4A
Synonyms:Hepatitis C virus serine protease, NS3/NS4A
Type:n/a
Mol. Mass.:n/a
Description:ASSAY_ID of ChEMBL is 1969955
Components:This complex has 2 components.
Component 1
Name:Non-structural protein 4A
Type:PROTEIN
Mol. Mass.:5762.65
Organism:Hepatitis C virus
Description:ChEMBL_305334
Residue:54
Component 2
Name:Genome polyprotein
Synonyms:Hepatitis C virus NS3 protease/helicase | Hepatitis C virus serine protease, NS3/NS4A
Type:Protein
Mol. Mass.:67067.41
Organism:Hepatitis C virus
Description:A3EZI9
Residue:631
BDBM50141196
NameBDBM50141196
Synonyms:1-[3-methyl-2-[2-methyl-1-(2-pyrazinylcarboxamido)-(1R)-propylcarboxamido]-(2R)-butanoyl]-5-{1-[1-methyl-2-(1-naphthyl)-2-oxo-(1S)-ethylcarbamoylcarbonyl]butylcarbamoyl}-(3R,5S)-tetrahydro-1H-3-pyrrolyl 1,2,3,4-tetrahydro-2-isoquinolinec | CHEMBL284771
TypeSmall organic molecule
Emp. Form.C49H58N8O9
Mol. Mass.903.033
SMILESCCCC(NC(=O)[C@@H]1C[C@H](CN1C(=O)[C@H](NC(=O)[C@H](NC(=O)c1cnccn1)C(C)C)C(C)C)OC(=O)N1CCc2ccccc2C1)C(=O)C(=O)N[C@@H](C)C(=O)c1cccc2ccccc12