Reaction Details
TargetPeptide deformylase
LigandBDBM50224040
Substrate/Competitorn/a
Meas. Tech.ChEMBL_144950 (CHEMBL755896)
IC50<5±n/a nM
Citation Molteni, VHe, XNabakka, JYang, KKreusch, AGordon, PBursulaya, BWarner, IShin, TBiorac, TRyder, NSGoldberg, RDoughty, JHe, Y Identification of novel potent bicyclic peptide deformylase inhibitors. Bioorg Med Chem Lett14:1477-81 (2004) 
 
Peptide deformylase
Name:Peptide deformylase
Type:PROTEIN
Mol. Mass.:20556.80
Organism:Staphylococcus aureus (strain Mu50 / ATCC 700699)
Description:ChEMBL_459563
Residue:183
BDBM50224040
NameBDBM50224040
Synonyms:CHEMBL286441
TypeSmall organic molecule
Emp. Form.C15H20N2O3S
Mol. Mass.308.396
SMILESCCCCCN1C(=O)C(CC(=O)NO)Sc2ccccc12