Reaction Details
TargetEndothelin receptor type B
LigandBDBM50141468
Substrate/Competitorn/a
Meas. Tech.ChEBML_63695
IC50 43±n/a nM
Citation Takahashi, HOhtake, NSakamoto, TIino, TKawanishi, NNakamura, MYoshizumi, TNiiyama, KOzaki, SOkada, HKano, ATakahashi, HIshii, YOkada, MSaito, MSawazaki, YHayama, TNishikibe, M Structure-activity relationships of a novel class of endothelin receptor selective antagonists; 6-carboxy-2-isopropylamino-5,7-diarylcyclopenteno[1,2-b]pyridines. Bioorg Med Chem Lett14:1503-7 (2004) 
 
Endothelin receptor type B
Name:Endothelin receptor type B
Type:Enzyme Catalytic Domain
Mol. Mass.:49664.00
Organism:Homo sapiens (Human)
Description:ENDOTHELIN B EDNRB HUMAN::P24530
Residue:442
BDBM50141468
NameBDBM50141468
Synonyms:(5S,6R,7R)-5-Benzo[1,3]dioxol-5-yl-7-[2-(2-dimethylcarbamoyl-propyl)-4-methoxy-phenyl]-2-isopropylamino-6,7-dihydro-5H-[1]pyrindine-6-carboxylic acid | CHEMBL287683
TypeSmall organic molecule
Emp. Form.C32H37N3O6
Mol. Mass.559.6527
SMILESCOc1ccc([C@H]2[C@@H]([C@H](c3ccc(NC(C)C)nc23)c2ccc3OCOc3c2)C(O)=O)c(CC(C)C(=O)N(C)C)c1