Reaction Details
TargetEndothelin-1 receptor
LigandBDBM50141462
Substrate/Competitorn/a
Meas. Tech.ChEBML_65489
IC50 0.410000±n/a nM
Citation Takahashi, HOhtake, NSakamoto, TIino, TKawanishi, NNakamura, MYoshizumi, TNiiyama, KOzaki, SOkada, HKano, ATakahashi, HIshii, YOkada, MSaito, MSawazaki, YHayama, TNishikibe, M Structure-activity relationships of a novel class of endothelin receptor selective antagonists; 6-carboxy-2-isopropylamino-5,7-diarylcyclopenteno[1,2-b]pyridines. Bioorg Med Chem Lett14:1503-7 (2004) 
 
Endothelin-1 receptor
Name:Endothelin-1 receptor
Type:Enzyme Catalytic Domain
Mol. Mass.:48736.88
Organism:Homo sapiens (Human)
Description:P25101
Residue:427
BDBM50141462
NameBDBM50141462
Synonyms:(5S,6R,7R)-5-Benzo[1,3]dioxol-5-yl-2-isopropylamino-7-(4-methoxy-2-propoxy-phenyl)-6,7-dihydro-5H-[1]pyrindine-6-carboxylic acid | CHEMBL291247
TypeSmall organic molecule
Emp. Form.C29H32N2O6
Mol. Mass.504.5742
SMILESCCCOc1cc(OC)ccc1[C@H]1[C@@H]([C@H](c2ccc(NC(C)C)nc12)c1ccc2OCOc2c1)C(O)=O