Reaction Details
TargetRetinoic acid receptor RXR-alpha
LigandBDBM50141589
Substrate/Competitorn/a
Meas. Tech.ChEMBL_196920 (CHEMBL807382)
Ki 16±n/a nM
Citation Michellys, PYD'Arrigo, JGrese, TAKaranewsky, DSLeibowitz, MDMais, DAMapes, CMReifel-Miller, ARungta, DBoehm, MF Design, synthesis and structure-activity relationship of novel RXR-selective modulators. Bioorg Med Chem Lett14:1593-8 (2004) 
 
Retinoic acid receptor RXR-alpha
Name:Retinoic acid receptor RXR-alpha
Type:PROTEIN
Mol. Mass.:50820.38
Organism:Homo sapiens (Human)
Description:ChEMBL_1456363
Residue:462
BDBM50141589
NameBDBM50141589
Synonyms:(Z)-3-[7-(2-Butoxy-3,5-diisopropyl-phenyl)-benzofuran-2-yl]-2-fluoro-but-2-enoic acid | CHEMBL290246
TypeSmall organic molecule
Emp. Form.C28H33FO4
Mol. Mass.452.5576
SMILESCCCCOc1c(cc(cc1-c1cccc2cc(oc12)C(\C)=C(/F)C(O)=O)C(C)C)C(C)C