Reaction Details
TargetRetinoic acid receptor RXR-beta
LigandBDBM50452047
Substrate/Competitorn/a
Meas. Tech.ChEBML_196588
Ki>10000±n/a nM
Citation Michellys, PYD'Arrigo, JGrese, TAKaranewsky, DSLeibowitz, MDMais, DAMapes, CMReifel-Miller, ARungta, DBoehm, MF Design, synthesis and structure-activity relationship of novel RXR-selective modulators. Bioorg Med Chem Lett14:1593-8 (2004) 
 
Retinoic acid receptor RXR-beta
Name:Retinoic acid receptor RXR-beta
Type:PROTEIN
Mol. Mass.:55877.78
Organism:Mus musculus
Description:ChEMBL_196588
Residue:520
BDBM50452047
NameBDBM50452047
Synonyms:CHEMBL2372524
TypeSmall organic molecule
Emp. Form.C14H21N4O6P
Mol. Mass.372.3135
SMILESC[C@H](NC(=O)[C@H](Cc1ccccc1)NP(O)(O)=O)C(=O)NCC(N)=O