Reaction Details
TargetRetinoic acid receptor RXR-alpha
LigandBDBM50141605
Substrate/Competitorn/a
Meas. Tech.ChEBML_196596
IC50 128±n/a nM
Citation Michellys, PYD'Arrigo, JGrese, TAKaranewsky, DSLeibowitz, MDMais, DAMapes, CMReifel-Miller, ARungta, DBoehm, MF Design, synthesis and structure-activity relationship of novel RXR-selective modulators. Bioorg Med Chem Lett14:1593-8 (2004) 
 
Retinoic acid receptor RXR-alpha
Name:Retinoic acid receptor RXR-alpha
Type:PROTEIN
Mol. Mass.:50820.38
Organism:Homo sapiens (Human)
Description:ChEMBL_1456363
Residue:462
BDBM50141605
NameBDBM50141605
Synonyms:(E)-3-[7-(3,5-Diisopropyl-2-propoxy-phenyl)-benzofuran-2-yl]-but-2-enoic acid | CHEMBL41675
TypeSmall organic molecule
Emp. Form.C27H32O4
Mol. Mass.420.5406
SMILESCCCOc1c(cc(cc1-c1cccc2cc(oc12)C(\C)=C\C(O)=O)C(C)C)C(C)C