Reaction Details
TargetRetinoic acid receptor alpha
LigandBDBM50141590
Substrate/Competitorn/a
Meas. Tech.ChEBML_196468
Ki>10000±n/a nM
Citation Michellys, PYD'Arrigo, JGrese, TAKaranewsky, DSLeibowitz, MDMais, DAMapes, CMReifel-Miller, ARungta, DBoehm, MF Design, synthesis and structure-activity relationship of novel RXR-selective modulators. Bioorg Med Chem Lett14:1593-8 (2004) 
 
Retinoic acid receptor alpha
Name:Retinoic acid receptor alpha
Type:PROTEIN
Mol. Mass.:50778.87
Organism:Homo sapiens (Human)
Description:ChEMBL_1466191
Residue:462
BDBM50141590
NameBDBM50141590
Synonyms:(E)-3-[4-(2-Ethoxy-3,5-diisopropyl-phenyl)-benzo[b]thiophen-2-yl]-but-2-enoic acid | CHEMBL41890
TypeSmall organic molecule
Emp. Form.C26H30O3S
Mol. Mass.422.58
SMILESCCOc1c(cc(cc1-c1cccc2sc(cc12)C(\C)=C\C(O)=O)C(C)C)C(C)C