Reaction Details
TargetRetinoic acid receptor RXR-beta
LigandBDBM50141596
Substrate/Competitorn/a
Meas. Tech.ChEBML_196588
Ki>10000±n/a nM
Citation Michellys, PYD'Arrigo, JGrese, TAKaranewsky, DSLeibowitz, MDMais, DAMapes, CMReifel-Miller, ARungta, DBoehm, MF Design, synthesis and structure-activity relationship of novel RXR-selective modulators. Bioorg Med Chem Lett14:1593-8 (2004) 
 
Retinoic acid receptor RXR-beta
Name:Retinoic acid receptor RXR-beta
Type:PROTEIN
Mol. Mass.:55877.78
Organism:Mus musculus
Description:ChEMBL_196588
Residue:520
BDBM50141596
NameBDBM50141596
Synonyms:(E)-3-{4-[3,5-Di-tert-butyl-2-(2,2-difluoro-ethoxy)-phenyl]-benzo[b]thiophen-2-yl}-but-2-enoic acid | CHEMBL290761
TypeSmall organic molecule
Emp. Form.C28H32F2O3S
Mol. Mass.486.614
SMILESC\C(=C/C(O)=O)c1cc2c(cccc2s1)-c1cc(cc(c1OCC(F)F)C(C)(C)C)C(C)(C)C