Reaction Details
TargetRetinoic acid receptor RXR-alpha
LigandBDBM50141592
Substrate/Competitorn/a
Meas. Tech.ChEMBL_196594 (CHEMBL800472)
EC50 39±n/a nM
Citation Michellys, PYD'Arrigo, JGrese, TAKaranewsky, DSLeibowitz, MDMais, DAMapes, CMReifel-Miller, ARungta, DBoehm, MF Design, synthesis and structure-activity relationship of novel RXR-selective modulators. Bioorg Med Chem Lett14:1593-8 (2004) 
 
Retinoic acid receptor RXR-alpha
Name:Retinoic acid receptor RXR-alpha
Type:PROTEIN
Mol. Mass.:50820.38
Organism:Homo sapiens (Human)
Description:ChEMBL_1456363
Residue:462
BDBM50141592
NameBDBM50141592
Synonyms:(E)-3-[4-(3,5-Di-tert-butyl-2-methyl-phenyl)-benzo[b]thiophen-2-yl]-but-2-enoic acid | CHEMBL44420
TypeSmall organic molecule
Emp. Form.C27H32O2S
Mol. Mass.420.607
SMILESC\C(=C/C(O)=O)c1cc2c(cccc2s1)-c1cc(cc(c1C)C(C)(C)C)C(C)(C)C