Reaction Details
TargetRetinoic acid receptor RXR-alpha
LigandBDBM50141595
Substrate/Competitorn/a
Meas. Tech.ChEMBL_196920 (CHEMBL807382)
Ki 3±n/a nM
Citation Michellys, PYD'Arrigo, JGrese, TAKaranewsky, DSLeibowitz, MDMais, DAMapes, CMReifel-Miller, ARungta, DBoehm, MF Design, synthesis and structure-activity relationship of novel RXR-selective modulators. Bioorg Med Chem Lett14:1593-8 (2004) 
 
Retinoic acid receptor RXR-alpha
Name:Retinoic acid receptor RXR-alpha
Type:PROTEIN
Mol. Mass.:50820.38
Organism:Homo sapiens (Human)
Description:ChEMBL_1456363
Residue:462
BDBM50141595
NameBDBM50141595
Synonyms:(E)-3-{4-[3,5-Di-tert-butyl-2-(3-fluoro-propoxy)-phenyl]-benzo[b]thiophen-2-yl}-but-2-enoic acid | CHEMBL41146
TypeSmall organic molecule
Emp. Form.C29H35FO3S
Mol. Mass.482.65
SMILESC\C(=C/C(O)=O)c1cc2c(cccc2s1)-c1cc(cc(c1OCCCF)C(C)(C)C)C(C)(C)C