Reaction Details
TargetPeptidyl-prolyl cis-trans isomerase FKBP5
LigandBDBM50125333
Substrate/Competitorn/a
Meas. Tech.ChEMBL_2125785 (CHEMBL4835130)
Kd 9.8±n/a nM
Citation Bauder, MMeyners, CPurder, PLMerz, SSugiarto, WOVoll, AMHeymann, THausch, F Structure-Based Design of High-Affinity Macrocyclic FKBP51 Inhibitors. J Med Chem64:3320-3349 (2021) 
 
Peptidyl-prolyl cis-trans isomerase FKBP5
Name:Peptidyl-prolyl cis-trans isomerase FKBP5
Type:PROTEIN
Mol. Mass.:51207.06
Organism:Homo sapiens (Human)
Description:ChEMBL_952910
Residue:457
BDBM50125333
NameBDBM50125333
Synonyms:CHEMBL3623612
TypeSmall organic molecule
Emp. Form.C42H53NO11
Mol. Mass.747.8703
SMILESCOc1ccc(CC[C@@H](OC(=O)[C@@H]2CCCCN2C(=O)[C@@H](C2CCCCC2)c2cc(OC)c(OC)c(OC)c2)c2cccc(OCC(O)=O)c2)cc1OC