Reaction Details
TargetGlucocorticoid receptor
LigandBDBM50107347
Substrate/Competitorn/a
Meas. Tech.ChEBML_44512
IC50 6.9±n/a nM
Citation Elmore, SWPratt, JKCoghlan, MJMao, YGreen, BEAnderson, DDStashko, MALin, CWFalls, DNakane, MMiller, LTyree, CMMiner, JNLane, B Differentiation of in vitro transcriptional repression and activation profiles of selective glucocorticoid modulators. Bioorg Med Chem Lett14:1721-7 (2004) 
 
Glucocorticoid receptor
Name:Glucocorticoid receptor
Type:Enzyme
Mol. Mass.:85656.87
Organism:Homo sapiens (Human)
Description:P04150
Residue:777
BDBM50107347
NameBDBM50107347
Synonyms:(+)5-Allyl-10-methoxy-2,2,4-trimethyl-2,5-dihydro-1H-6-oxa-1-aza-chrysene (-)5-Allyl-10-methoxy-2,2,4-trimethyl-2,5-dihydro-1H-6-oxa-1-aza-chrysene 5-allyl-10-methoxy-2,2,4-trimethyl-2,5-dihydro-1H-chromeno[3,4-f]quinoline | CHEMBL266282
TypeSmall organic molecule
Emp. Form.C23H25NO2
Mol. Mass.347.4501
SMILESCOc1cccc2OC(CC=C)c3c(ccc4NC(C)(C)C=C(C)c34)-c12