Reaction Details
TargetEukaryotic initiation factor 4A-I
LigandBDBM50576669
Substrate/Competitorn/a
Meas. Tech.ChEMBL_2127676 (CHEMBL4837021)
IC50 5.6±n/a nM
Citation Nilewski, CMichels, TDPackard, GKXiang, AXSprengeler, PAEam, BFish, SThompson, PAWegerski, CJNevarez, AClarine, JSperry, SErnst, JTReich, SH 1-Aminomethyl SAR in a novel series of flavagline-inspired eIF4A inhibitors: Effects of amine substitution on cell potency and in vitro PK properties. Bioorg Med Chem Lett47:0 (2021) 
 
Eukaryotic initiation factor 4A-I
Name:Eukaryotic initiation factor 4A-I
Type:PROTEIN
Mol. Mass.:46146.87
Organism:Homo sapiens (Human)
Description:ChEMBL_864983
Residue:406
BDBM50576669
NameBDBM50576669
Synonyms:CHEMBL4855528
TypeSmall organic molecule
Emp. Form.C25H23N3O3
Mol. Mass.413.4684
SMILESCOc1cncc2O[C@]3([C@@H](C[C@H](CN)[C@@]3(O)c12)c1ccccc1)c1ccc(cc1)C#N