Reaction Details
TargetGenome polyprotein/Non-structural protein 4A
LigandBDBM50143470
Substrate/Competitorn/a
Meas. Tech.ChEMBL_143636 (CHEMBL752796)
Ki 120±n/a nM
Citation Perni, RBFarmer, LJCottrell, KMCourt, JJCourtney, LFDeininger, DDGates, CAHarbeson, SLKim, JLLin, CLin, KLuong, YPMaxwell, JPMurcko, MAPitlik, JRao, BGSchairer, WCTung, RDVan Drie, JHWilson, KThomson, JA Inhibitors of hepatitis C virus NS3.4A protease. Part 3: P2 proline variants. Bioorg Med Chem Lett14:1939-42 (2004) 
 
Genome polyprotein/Non-structural protein 4A
Name:Genome polyprotein/Non-structural protein 4A
Synonyms:Hepatitis C virus serine protease, NS3/NS4A
Type:n/a
Mol. Mass.:n/a
Description:ASSAY_ID of ChEMBL is 1969955
Components:This complex has 2 components.
Component 1
Name:Non-structural protein 4A
Type:PROTEIN
Mol. Mass.:5762.65
Organism:Hepatitis C virus
Description:ChEMBL_305334
Residue:54
Component 2
Name:Genome polyprotein
Synonyms:Hepatitis C virus NS3 protease/helicase | Hepatitis C virus serine protease, NS3/NS4A
Type:Protein
Mol. Mass.:67067.41
Organism:Hepatitis C virus
Description:A3EZI9
Residue:631
BDBM50143470
NameBDBM50143470
Synonyms:2-((S)-3-{[(4S,5R)-3-sec-Butyl-1-((R)-3-methyl-2-{(R)-3-methyl-2-[(pyrazine-2-carbonyl)-amino]-butyrylamino}-butyryl)-pyrrolidine-2-carbonyl]-amino}-2-oxo-hexanoylamino)-3-phenyl-propionic acid | CHEMBL353559
TypeSmall organic molecule
Emp. Form.C39H55N7O8
Mol. Mass.749.8961
SMILESCCC[C@H](NC(=O)[C@@H]1[C@H](CCN1C(=O)[C@H](NC(=O)[C@H](NC(=O)c1cnccn1)C(C)C)C(C)C)C(C)CC)C(=O)C(=O)N[C@@H](Cc1ccccc1)C(O)=O