Reaction Details
TargetDNA nucleotidylexotransferase
LigandBDBM50143526
Substrate/Competitorn/a
Meas. Tech.ChEBML_210231
IC50 16000±n/a nM
Citation Saito, FTakeuchi, RKamino, TKuramochi, KSugawara, FSakaguchi, KKobayashi, S Structure-activity relationships of untenone A and its derivatives for inhibition of DNA polymerases. Bioorg Med Chem Lett14:1975-7 (2004) 
 
DNA nucleotidylexotransferase
Name:DNA nucleotidylexotransferase
Type:PROTEIN
Mol. Mass.:58545.66
Organism:Homo sapiens (Human)
Description:ChEMBL_210231
Residue:509
BDBM50143526
NameBDBM50143526
Synonyms:CHEMBL366792 | Untenone A
TypeSmall organic molecule
Emp. Form.C23H40O4
Mol. Mass.380.5613
[C@]1(O)C=CC(=O)[C@H]1C(=O)OC