Reaction Details
TargetCapsid scaffolding protein
LigandBDBM50143640
Substrate/Competitorn/a
Meas. Tech.ChEMBL_77299 (CHEMBL687228)
IC50 2.7±n/a nM
Citation Gopalsamy, ALim, KEllingboe, JWMitsner, BNikitenko, AUpeslacis, JMansour, TSOlson, MWBebernitz, GAGrinberg, DFeld, BMoy, FJO'Connell, J Design and syntheses of 1,6-naphthalene derivatives as selective HCMV protease inhibitors. J Med Chem47:1893-9 (2004) 
 
Capsid scaffolding protein
Name:Capsid scaffolding protein
Type:PROTEIN
Mol. Mass.:73854.16
Organism:Human cytomegalovirus (strain AD169) (HHV-5) (Human herpesvirus 5)
Description:ChEMBL_158958
Residue:708
BDBM50143640
NameBDBM50143640
Synonyms:4-({5-[(E)-2-(7-Chloro-quinolin-2-yl)-vinyl]-naphthalen-2-ylamino}-methyl)-benzoic acid | CHEMBL56849
TypeSmall organic molecule
Emp. Form.C29H21ClN2O2
Mol. Mass.464.942
SMILESOC(=O)c1ccc(CNc2ccc3c(\C=C\c4ccc5ccc(Cl)cc5n4)cccc3c2)cc1