Reaction Details
TargetCapsid scaffolding protein
LigandBDBM50143649
Substrate/Competitorn/a
Meas. Tech.ChEMBL_77299 (CHEMBL687228)
IC50>50±n/a nM
Citation Gopalsamy, ALim, KEllingboe, JWMitsner, BNikitenko, AUpeslacis, JMansour, TSOlson, MWBebernitz, GAGrinberg, DFeld, BMoy, FJO'Connell, J Design and syntheses of 1,6-naphthalene derivatives as selective HCMV protease inhibitors. J Med Chem47:1893-9 (2004) 
 
Capsid scaffolding protein
Name:Capsid scaffolding protein
Type:PROTEIN
Mol. Mass.:73854.16
Organism:Human cytomegalovirus (strain AD169) (HHV-5) (Human herpesvirus 5)
Description:ChEMBL_158958
Residue:708
BDBM50143649
NameBDBM50143649
Synonyms:CHEMBL59252 | {5-[(E)-2-(6-Chloro-quinolin-2-yl)-vinyl]-naphthalen-2-yl}-carbamic acid phenyl ester
TypeSmall organic molecule
Emp. Form.C28H19ClN2O2
Mol. Mass.450.916
SMILESClc1ccc2nc(C=Cc3cccc4cc(NC(=O)Oc5ccccc5)ccc34)ccc2c1