Reaction Details
TargetAlpha-1D adrenergic receptor
LigandBDBM50143683
Substrate/Competitorn/a
Meas. Tech.ChEMBL_32721 (CHEMBL645993)
Ki 1.23±n/a nM
Citation Leonardi, ABarlocco, DMontesano, FCignarella, GMotta, GTesta, RPoggesi, ESeeber, MDe Benedetti, PGFanelli, F Synthesis, screening, and molecular modeling of new potent and selective antagonists at the alpha 1d adrenergic receptor. J Med Chem47:1900-18 (2004) 
 
Alpha-1D adrenergic receptor
Name:Alpha-1D adrenergic receptor
Type:Protein
Mol. Mass.:59375.97
Organism:Rattus norvegicus (Rat)
Description:P23944
Residue:561
BDBM50143683
NameBDBM50143683
Synonyms:1-{2-[4-(2,5-Dichloro-phenyl)-piperazin-1-yl]-ethyl}-4-ethyl-4-methyl-piperidine-2,6-dione | CHEMBL57317
TypeSmall organic molecule
Emp. Form.C20H27Cl2N3O2
Mol. Mass.412.353
SMILESCCC1(C)CC(=O)N(CCN2CCN(CC2)c2cc(Cl)ccc2Cl)C(=O)C1