Reaction Details
TargetStromelysin-1
LigandBDBM50141577
Substrate/Competitorn/a
Meas. Tech.ChEMBL_104746 (CHEMBL710746)
Ki 3.3±n/a nM
Citation Moriyama, HTsukida, TInoue, YYokota, KYoshino, KKondo, HMiura, NNishimura, S Azasugar-based MMP/ADAM inhibitors as antipsoriatic agents. J Med Chem47:1930-8 (2004) 
 
Stromelysin-1
Name:Stromelysin-1
Type:Enzyme
Mol. Mass.:53973.13
Organism:Homo sapiens (Human)
Description: P08254
Residue:477
BDBM50141577
NameBDBM50141577
Synonyms:(2R,3R,4R,5R)-1-(4-But-2-ynyloxy-benzenesulfonyl)-3,4,5-trihydroxy-piperidine-2-carboxylic acid hydroxyamide | CHEMBL43087
TypeSmall organic molecule
Emp. Form.C16H20N2O8S
Mol. Mass.400.404
SMILESCC#CCOc1ccc(cc1)S(=O)(=O)N1C[C@@H](O)[C@@H](O)[C@H](O)[C@@H]1C(=O)NO