Reaction Details
TargetInterstitial collagenase
LigandBDBM50143730
Substrate/Competitorn/a
Meas. Tech.ChEMBL_106135 (CHEMBL872563)
Ki 162±n/a nM
Citation Moriyama, HTsukida, TInoue, YYokota, KYoshino, KKondo, HMiura, NNishimura, S Azasugar-based MMP/ADAM inhibitors as antipsoriatic agents. J Med Chem47:1930-8 (2004) 
 
Interstitial collagenase
Name:Interstitial collagenase
Type:Enzyme
Mol. Mass.:54010.26
Organism:Homo sapiens (Human)
Description: P03956
Residue:469
BDBM50143730
NameBDBM50143730
Synonyms:(2R,3R,4R,5R)-1-(Biphenyl-4-sulfonyl)-3,4,5-trihydroxy-piperidine-2-carboxylic acid hydroxyamide | CHEMBL60536
TypeSmall organic molecule
Emp. Form.C18H20N2O7S
Mol. Mass.408.426
SMILESONC(=O)[C@H]1[C@@H](O)[C@H](O)[C@H](O)CN1S(=O)(=O)c1ccc(cc1)-c1ccccc1