Reaction Details
TargetIntegrin alpha-V/beta-3
LigandBDBM50143842
Substrate/Competitorn/a
Meas. Tech.ChEMBL_214628 (CHEMBL819708)
IC50>50000±n/a nM
Citation Mehrotra, MMHeath, JASmyth, MSPandey, ARose, JWSeroogy, JMVolkots, DLNannizzi-Alaimo, LPark, GLLambing, JLHollenbach, SJScarborough, RM Discovery of novel 2,8-diazaspiro[4.5]decanes as orally active glycoprotein IIb-IIIa antagonists. J Med Chem47:2037-61 (2004) 
 
Integrin alpha-V/beta-3
Name:Integrin alpha-V/beta-3
Type:Enzyme
Mol. Mass.:n/a
Description:n/a
Components:This complex has 2 components.
Component 1
Name:Integrin alpha-V
Synonyms:ITAV_HUMAN Integrin alpha-V/alpha-5 VNRA Vitronectin receptor | Vitronectin receptor subunit alpha
Type:PROTEIN
Mol. Mass.:116024.92
Organism:Homo sapiens (Human)
Description:ChEMBL_582336
Residue:1048
Component 2
Name:Integrin beta-3
Synonyms:CD_antigen=CD61 GPIIIa ITGB3 Platelet membrane glycoprotein IIIa
Type:Protein
Mol. Mass.:87038.91
Organism:Homo sapiens (Human)
Description:P05106
Residue:788
BDBM50143842
NameBDBM50143842
Synonyms:3-{[2-(4-Carbamimidoyl-phenyl)-1-oxo-2,8-diaza-spiro[4.5]decane-8-carbonyl]-amino}-propionic acid | CHEMBL65477
TypeSmall organic molecule
Emp. Form.C19H25N5O4
Mol. Mass.387.4329
SMILESNC(=N)c1ccc(cc1)N1CCC2(CCN(CC2)C(=O)NCCC(O)=O)C1=O