Reaction Details
TargetSodium channel protein type 1/2/3 subunit alpha
LigandBDBM50143975
Substrate/Competitorn/a
Meas. Tech.ChEMBL_202416 (CHEMBL805571)
IC50 214±n/a nM
Citation Ashwell, MALapierre, JMKaplan, ALi, JMarr, CYuan, J The design, preparation and SAR of novel small molecule sodium (Na(+)) channel blockers. Bioorg Med Chem Lett14:2025-30 (2004) 
 
Sodium channel protein type 1/2/3 subunit alpha
Name:Sodium channel protein type 1/2/3 subunit alpha
Type:n/a
Mol. Mass.:n/a
Description:ASSAY_ID of EBI is 202416
Components:This complex has 3 components.
Component 1
Name:Sodium channel protein type 1 subunit alpha
Synonyms:SCN1A_RAT Sodium (Site 1) Sodium channel protein type I alpha subunit Sodium channel protein, brain I subunit alpha Voltage-gated sodium channel subunit alpha Nav1.1
Type:PROTEIN
Mol. Mass.:228753.20
Organism:Rattus norvegicus
Description:ChEMBL_938840
Residue:2009
Component 2
Name:Sodium channel protein type 2 subunit alpha
Synonyms:SCN2A_RAT Scn2a1 Sodium channel protein type 2 subunit alpha Sodium channel protein type II subunit alpha Voltage-gated sodium channel | Voltage-gated sodium channel subunit alpha Nav1.2
Type:PROTEIN
Mol. Mass.:227854.11
Organism:Rattus norvegicus
Description:ChEMBL_1516893
Residue:2005
Component 3
Name:Sodium channel protein type 3 subunit alpha
Synonyms:SCN3A_RAT Sodium channel protein type 3 subunit alpha Sodium channel protein type III subunit alpha Voltage-gated sodium channel Voltage-gated sodium channel subunit alpha Nav1.3
Type:PROTEIN
Mol. Mass.:221371.72
Organism:Rattus norvegicus
Description:ChEMBL_1516894
Residue:1951
BDBM50143975
NameBDBM50143975
Synonyms:2-(4-Fluoro-phenyl)-2-{4-[2-hydroxy-3-(4-methoxy-phenoxy)-propyl]-piperazin-1-yl}-N-(4-methoxy-benzyl)-acetamide | CHEMBL64505
TypeSmall organic molecule
Emp. Form.C30H36FN3O5
Mol. Mass.537.6223
SMILESCOc1ccc(CNC(=O)C(N2CCN(CC(O)COc3ccc(OC)cc3)CC2)c2ccc(F)cc2)cc1