Reaction Details
TargetGlucagon receptor
LigandBDBM50144007
Substrate/Competitorn/a
Meas. Tech.ChEBML_72991
Ki 80±n/a nM
Citation Kurukulasuriya, RSorensen, BKLink, JTPatel, JRJae, HSWinn, MXRohde, JRGrihalde, NDLin, CWOgiela, CAAdler, ALCollins, CA Biaryl amide glucagon receptor antagonists. Bioorg Med Chem Lett14:2047-50 (2004) 
 
Glucagon receptor
Name:Glucagon receptor
Type:Enzyme
Mol. Mass.:54026.92
Organism:Homo sapiens (Human)
Description:P47871
Residue:477
BDBM50144007
NameBDBM50144007
Synonyms:3-{4-[2-(4-tert-Butyl-phenyl)-2-(3-ethyl-phenylcarbamoyl)-ethyl]-benzoylamino}-propionic acid | CHEMBL62704
TypeSmall organic molecule
Emp. Form.C31H36N2O4
Mol. Mass.500.6285
SMILESCCc1cccc(NC(=O)C(Cc2ccc(cc2)C(=O)NCCC(O)=O)c2ccc(cc2)C(C)(C)C)c1