Reaction Details
TargetGlyceraldehyde-3-phosphate dehydrogenase
LigandBDBM50144455
Substrate/Competitorn/a
Meas. Tech.ChEMBL_72894 (CHEMBL684061)
IC50 12000±n/a nM
Citation Leitão, AAndricopulo, ADOliva, GPupo, MTde Marchi, AAVieira, PCda Silva, MFFerreira, VFde Souza, MCSá, MMMoraes, VRMontanari, CA Structure-activity relationships of novel inhibitors of glyceraldehyde-3-phosphate dehydrogenase. Bioorg Med Chem Lett14:2199-204 (2004) 
 
Glyceraldehyde-3-phosphate dehydrogenase
Name:Glyceraldehyde-3-phosphate dehydrogenase
Type:PROTEIN
Mol. Mass.:36060.86
Organism:Homo sapiens (Human)
Description:ChEMBL_1511315
Residue:335
BDBM50144455
NameBDBM50144455
Synonyms:CHEMBL71742 | N-((2R,5R)-4-Hydroxy-5-hydroxymethyl-2-{6-[(naphthalen-1-ylmethyl)-amino]-purin-9-yl}-tetrahydro-furan-3-yl)-3-methoxy-benzamide
TypeSmall organic molecule
Emp. Form.C29H28N6O5
Mol. Mass.540.5698
SMILESCOc1cccc(c1)C(=O)NC1C(O)[C@@H](CO)O[C@H]1n1cnc2c(NCc3cccc4ccccc34)ncnc12