Reaction Details
TargetTransient receptor potential cation channel subfamily V member 1
LigandBDBM50144663
Substrate/Competitorn/a
Meas. Tech.ChEBML_42207
Ki 1042±n/a nM
Citation Lee, JKang, SUChoi, HKLee, JLim, JOKil, MJJin, MKKim, KPSung, JHChung, SJHa, HJKim, YHPearce, LVTran, RLundberg, DJWang, YToth, ABlumberg, PM Analysis of structure-activity relationships for the 'B-region' of N-(3-acyloxy-2-benzylpropyl)-N(')-[4-(methylsulfonylamino)benzyl]thiourea analogues as vanilloid receptor antagonists: discovery of an N-hydroxythiourea analogue with potent analgesic activity. Bioorg Med Chem Lett14:2291-7 (2004) 
 
Transient receptor potential cation channel subfamily V member 1
Name:Transient receptor potential cation channel subfamily V member 1
Type:Transient Receptor
Mol. Mass.:94956.12
Organism:Rattus norvegicus (rat)
Description:O35433
Residue:838
BDBM50144663
NameBDBM50144663
Synonyms:2,2-Dimethyl-propionic acid 2-(3,4-dimethyl-benzyl)-3-[3-4-methanesulfonylamino-benzyl)-thioureido-N-hydroxy]-propyl ester | CHEMBL308999
TypeSmall organic molecule
Emp. Form.C26H37N3O5S2
Mol. Mass.535.719
SMILESCc1ccc(CC(COC(=O)C(C)(C)C)CN(O)C(=S)NCc2ccc(NS(C)(=O)=O)cc2)cc1C