Reaction Details
TargetTransient receptor potential cation channel subfamily V member 1
LigandBDBM20287
Substrate/Competitorn/a
Meas. Tech.ChEBML_42207
Ki 23±n/a nM
Citation Lee, JKang, SUChoi, HKLee, JLim, JOKil, MJJin, MKKim, KPSung, JHChung, SJHa, HJKim, YHPearce, LVTran, RLundberg, DJWang, YToth, ABlumberg, PM Analysis of structure-activity relationships for the 'B-region' of N-(3-acyloxy-2-benzylpropyl)-N(')-[4-(methylsulfonylamino)benzyl]thiourea analogues as vanilloid receptor antagonists: discovery of an N-hydroxythiourea analogue with potent analgesic activity. Bioorg Med Chem Lett14:2291-7 (2004) 
 
Transient receptor potential cation channel subfamily V member 1
Name:Transient receptor potential cation channel subfamily V member 1
Type:Transient Receptor
Mol. Mass.:94956.12
Organism:Rattus norvegicus (rat)
Description:O35433
Residue:838
BDBM20287
NameBDBM20287
Synonyms:2-[(4-tert-butylphenyl)methyl]-3-({[(3-fluoro-4-methanesulfonamidophenyl)methyl]carbamothioyl}amino)propyl 2,2-dimethylpropanoate thiourea antagonist, 2a
TypeSmall organic molecule
Emp. Form.C28H40FN3O4S2
Mol. Mass.565.763
SMILESCC(C)(C)C(=O)OCC(CNC(=S)NCc1ccc(NS(C)(=O)=O)c(F)c1)Cc1ccc(cc1)C(C)(C)C