Reaction Details
Target1-acyl-sn-glycerol-3-phosphate acyltransferase beta
LigandBDBM50144723
Substrate/Competitorn/a
Meas. Tech.ChEBML_100168
IC50 17±n/a nM
Citation Gong, BHong, FKohm, CJenkins, STulinsky, JBhatt, RDe Vries, PSinger, JWKlein, P Synthesis, SAR, and antitumor properties of diamino-C,N-diarylpyrimidine positional isomers: inhibitors of lysophosphatidic acid acyltransferase-beta. Bioorg Med Chem Lett14:2303-8 (2004) 
 
1-acyl-sn-glycerol-3-phosphate acyltransferase beta
Name:1-acyl-sn-glycerol-3-phosphate acyltransferase beta
Type:PROTEIN
Mol. Mass.:30924.09
Organism:Homo sapiens (Human)
Description:ChEMBL_321473
Residue:278
BDBM50144723
NameBDBM50144723
Synonyms:4-[2-Amino-6-(5-bromo-2-ethoxy-phenyl)-pyrimidin-4-ylamino]-benzonitrile | CHEMBL77883
TypeSmall organic molecule
Emp. Form.C19H16BrN5O
Mol. Mass.410.267
SMILESCCOc1ccc(Br)cc1-c1cc(Nc2ccc(cc2)C#N)nc(N)n1