Reaction Details
Target1-acyl-sn-glycerol-3-phosphate acyltransferase beta
LigandBDBM50144722
Substrate/Competitorn/a
Meas. Tech.ChEBML_100168
IC50 75.0±n/a nM
Citation Gong, BHong, FKohm, CJenkins, STulinsky, JBhatt, RDe Vries, PSinger, JWKlein, P Synthesis, SAR, and antitumor properties of diamino-C,N-diarylpyrimidine positional isomers: inhibitors of lysophosphatidic acid acyltransferase-beta. Bioorg Med Chem Lett14:2303-8 (2004) 
 
1-acyl-sn-glycerol-3-phosphate acyltransferase beta
Name:1-acyl-sn-glycerol-3-phosphate acyltransferase beta
Type:PROTEIN
Mol. Mass.:30924.09
Organism:Homo sapiens (Human)
Description:ChEMBL_321473
Residue:278
BDBM50144722
NameBDBM50144722
Synonyms:CHEMBL75522 | {4-[2-Amino-6-(5-chloro-2-ethoxy-phenyl)-pyrimidin-4-ylamino]-phenyl}-methanol
TypeSmall organic molecule
Emp. Form.C19H19ClN4O2
Mol. Mass.370.833
SMILESCCOc1ccc(Cl)cc1-c1cc(Nc2ccc(CO)cc2)nc(N)n1