Reaction Details
TargetIntegrin alpha-4/beta-7
LigandBDBM50144749
Substrate/Competitorn/a
Meas. Tech.ChEMBL_217618 (CHEMBL820361)
IC50 19±n/a nM
Citation Kamenecka, TMPark, YJLin, LSde Laszlo, SMcCauley, EDVan Riper, GEgger, LKidambi, UMumford, RATong, STang, WColletti, ATeffera, YStearns, RMacCoss, MSchmidt, JAHagmann, WK Amidines as amide bond replacements in VLA-4 antagonists. Bioorg Med Chem Lett14:2323-6 (2004) 
 
Integrin alpha-4/beta-7
Name:Integrin alpha-4/beta-7
Type:Protein Complex
Mol. Mass.:n/a
Description:The assay uses stably transfected K562 cells expressing human alpha4beta7 integrin.
Components:This complex has 2 components.
Component 1
Name:Integrin alpha-4
Synonyms:CD49 antigen-like family member D CD49d antigen ITA4_HUMAN Integrin alpha-4 Integrin alpha-IV VLA-4 integrin alpha 4 precursor | integrin alpha-4 precursor
Type:Membrane Protein
Mol. Mass.:114897.35
Organism:Homo sapiens (Human)
Description:P13612
Residue:1032
Component 2
Name:Integrin beta-7
Synonyms:ITB7_HUMAN Integrin alpha-4/beta-7 Integrin beta7
Type:Membrane Protein
Mol. Mass.:86893.88
Organism:Homo sapiens (Human)
Description:P26010
Residue:798
BDBM50144749
NameBDBM50144749
Synonyms:(S)-2-[((S)-1-Benzenesulfonyl-azetidine-2-carboximidoyl)-amino]-3-(2',6'-dimethoxy-biphenyl-4-yl)-propionic acid | CHEMBL420936
TypeSmall organic molecule
Emp. Form.C27H29N3O6S
Mol. Mass.523.601
SMILESCOc1cccc(OC)c1-c1ccc(C[C@H](N=C(N)[C@@H]2CCN2S(=O)(=O)c2ccccc2)C(O)=O)cc1