Reaction Details
TargetKappa-type opioid receptor
LigandBDBM50000780
Substrate/Competitorn/a
Meas. Tech.ChEMBL_2131565 (CHEMBL4841080)
Ki 6.1±n/a nM
Citation He, QWei, YLiu, XYe, RKong, LLi, ZJiang, SYu, LChai, JXie, QFu, WWang, YLi, WQiu, ZLiu, JShao, L Discovery of an  J Med Chem64:12414-12433 (2021) 
 
Kappa-type opioid receptor
Name:Kappa-type opioid receptor
Type:G Protein-Coupled Receptor (GPCR)
Mol. Mass.:42648.76
Organism:Homo sapiens (Human)
Description:P41145
Residue:380
BDBM50000780
NameBDBM50000780
Synonyms:2-(3,4-Dichloro-phenyl)-N-methyl-N-(2-pyrrolidin-1-yl-cyclohexyl)-acetamide CHEMBL593781
TypeSmall organic molecule
Emp. Form.C19H26Cl2N2O
Mol. Mass.369.329
SMILESCN([C@H]1CCCC[C@@H]1N1CCCC1)C(=O)Cc1ccc(Cl)c(Cl)c1