Reaction Details
TargetEstrogen receptor beta
LigandBDBM50145486
Substrate/Competitorn/a
Meas. Tech.ChEBML_67685
IC50 34±n/a nM
Citation Chen, HYKim, SWu, JYBirzin, ETChan, WYang, YTDahllund, JDiNinno, FRohrer, SPSchaeffer, JMHammond, ML Estrogen receptor ligands. Part 3: The SAR of dihydrobenzoxathiin SERMs. Bioorg Med Chem Lett14:2551-4 (2004) 
 
Estrogen receptor beta
Name:Estrogen receptor beta
Type:Protein
Mol. Mass.:59238.43
Organism:Homo sapiens (Human)
Description:Q92731
Residue:530
BDBM50145486
NameBDBM50145486
Synonyms:(2S,3R)-3-Cyclopentylmethyl-2-[4-(2-piperidin-1-yl-ethoxy)-phenyl]-2,3-dihydro-benzo[1,4]oxathiin-6-ol | CHEMBL315271
TypeSmall organic molecule
Emp. Form.C27H35NO3S
Mol. Mass.453.637
SMILESOc1ccc2O[C@H]([C@@H](CC3CCCC3)Sc2c1)c1ccc(OCCN2CCCCC2)cc1