Reaction Details
TargetEstrogen receptor beta
LigandBDBM50145487
Substrate/Competitorn/a
Meas. Tech.ChEBML_67685
IC50 162±n/a nM
Citation Chen, HYKim, SWu, JYBirzin, ETChan, WYang, YTDahllund, JDiNinno, FRohrer, SPSchaeffer, JMHammond, ML Estrogen receptor ligands. Part 3: The SAR of dihydrobenzoxathiin SERMs. Bioorg Med Chem Lett14:2551-4 (2004) 
 
Estrogen receptor beta
Name:Estrogen receptor beta
Type:Protein
Mol. Mass.:59238.43
Organism:Homo sapiens (Human)
Description:Q92731
Residue:530
BDBM50145487
NameBDBM50145487
Synonyms:(2S,3S)-2-[4-(2-Piperidin-1-yl-ethoxy)-phenyl]-3-thiophen-2-yl-2,3-dihydro-benzo[1,4]oxathiin-6-ol | CHEMBL83623
TypeSmall organic molecule
Emp. Form.C25H27NO3S2
Mol. Mass.453.617
SMILESOc1ccc2O[C@H]([C@H](Sc2c1)c1cccs1)c1ccc(OCCN2CCCCC2)cc1