Reaction Details
TargetEstrogen receptor
LigandBDBM50145485
Substrate/Competitorn/a
Meas. Tech.ChEBML_67484
IC50 7.4±n/a nM
Citation Chen, HYKim, SWu, JYBirzin, ETChan, WYang, YTDahllund, JDiNinno, FRohrer, SPSchaeffer, JMHammond, ML Estrogen receptor ligands. Part 3: The SAR of dihydrobenzoxathiin SERMs. Bioorg Med Chem Lett14:2551-4 (2004) 
 
Estrogen receptor
Name:Estrogen receptor
Type:Protein
Mol. Mass.:66230.44
Organism:Homo sapiens (Human)
Description:P03372
Residue:595
BDBM50145485
NameBDBM50145485
Synonyms:(2S,3R)-3-Benzyl-2-[4-(2-piperidin-1-yl-ethoxy)-phenyl]-2,3-dihydro-benzo[1,4]oxathiin-6-ol | CHEMBL85536
TypeSmall organic molecule
Emp. Form.C28H31NO3S
Mol. Mass.461.616
SMILESOc1ccc2O[C@H]([C@@H](Cc3ccccc3)Sc2c1)c1ccc(OCCN2CCCCC2)cc1