Reaction Details
TargetEstrogen receptor beta
LigandBDBM50145497
Substrate/Competitorn/a
Meas. Tech.ChEBML_67685
IC50 43±n/a nM
Citation Chen, HYKim, SWu, JYBirzin, ETChan, WYang, YTDahllund, JDiNinno, FRohrer, SPSchaeffer, JMHammond, ML Estrogen receptor ligands. Part 3: The SAR of dihydrobenzoxathiin SERMs. Bioorg Med Chem Lett14:2551-4 (2004) 
 
Estrogen receptor beta
Name:Estrogen receptor beta
Type:Protein
Mol. Mass.:59238.43
Organism:Homo sapiens (Human)
Description:Q92731
Residue:530
BDBM50145497
NameBDBM50145497
Synonyms:(2S,3R)-3-tert-Butyl-2-[4-(2-piperidin-1-yl-ethoxy)-phenyl]-2,3-dihydro-benzo[1,4]oxathiin-6-ol | CHEMBL419110
TypeSmall organic molecule
Emp. Form.C25H33NO3S
Mol. Mass.427.599
SMILESCC(C)(C)[C@H]1Sc2cc(O)ccc2O[C@H]1c1ccc(OCCN2CCCCC2)cc1