Reaction Details
TargetEstrogen receptor
LigandBDBM50145489
Substrate/Competitorn/a
Meas. Tech.ChEBML_67484
IC50 2.6±n/a nM
Citation Chen, HYKim, SWu, JYBirzin, ETChan, WYang, YTDahllund, JDiNinno, FRohrer, SPSchaeffer, JMHammond, ML Estrogen receptor ligands. Part 3: The SAR of dihydrobenzoxathiin SERMs. Bioorg Med Chem Lett14:2551-4 (2004) 
 
Estrogen receptor
Name:Estrogen receptor
Type:Protein
Mol. Mass.:66230.44
Organism:Homo sapiens (Human)
Description:P03372
Residue:595
BDBM50145489
NameBDBM50145489
Synonyms:(2S,3R)-3-Cyclohexyl-2-[4-(2-piperidin-1-yl-ethoxy)-phenyl]-2,3-dihydro-benzo[1,4]oxathiin-6-ol | CHEMBL85090
TypeSmall organic molecule
Emp. Form.C27H35NO3S
Mol. Mass.453.637
SMILESOc1ccc2O[C@H]([C@H](Sc2c1)C1CCCCC1)c1ccc(OCCN2CCCCC2)cc1