Reaction Details
TargetEstrogen receptor beta
LigandBDBM50145493
Substrate/Competitorn/a
Meas. Tech.ChEMBL_79392 (CHEMBL687925)
IC50 67±n/a nM
Citation Chen, HYKim, SWu, JYBirzin, ETChan, WYang, YTDahllund, JDiNinno, FRohrer, SPSchaeffer, JMHammond, ML Estrogen receptor ligands. Part 3: The SAR of dihydrobenzoxathiin SERMs. Bioorg Med Chem Lett14:2551-4 (2004) 
 
Estrogen receptor beta
Name:Estrogen receptor beta
Synonyms:Estrogen receptor
Type:n/a
Mol. Mass.:n/a
Description:ASSAY_ID of ChEMBL is 99778
Components:This complex has 2 components.
Component 1
Name:Estrogen receptor beta
Type:Protein
Mol. Mass.:59238.43
Organism:Homo sapiens (Human)
Description:Q92731
Residue:530
Component 2
Name:Estrogen receptor
Synonyms:ER ESR ESR1_HUMAN Estrogen receptor Estrogen receptor (ER-alpha) Estrogen receptor alpha (ER) Nuclear receptor subfamily 3 group A member 1
Type:Protein
Mol. Mass.:66230.44
Organism:Homo sapiens (Human)
Description:P03372
Residue:595
BDBM50145493
NameBDBM50145493
Synonyms:(2S,3R)-3-Cyclohexylmethyl-2-[4-(2-piperidin-1-yl-ethoxy)-phenyl]-2,3-dihydro-benzo[1,4]oxathiin-6-ol | CHEMBL85881
TypeSmall organic molecule
Emp. Form.C28H37NO3S
Mol. Mass.467.663
SMILESOc1ccc2O[C@H]([C@@H](CC3CCCCC3)Sc2c1)c1ccc(OCCN2CCCCC2)cc1