Reaction Details
TargetTyrosine-protein kinase Lck
LigandBDBM8807
Substrate/Competitorn/a
Meas. Tech.ChEBML_221313
IC50 24±n/a nM
Citation Borhani, DWCalderwood, DJFriedman, MMHirst, GCLi, BLeung, AKMcRae, BRatnofsky, SRitter, KWaegell, W A-420983: a potent, orally active inhibitor of lck with efficacy in a model of transplant rejection. Bioorg Med Chem Lett14:2613-6 (2004) 
 
Tyrosine-protein kinase Lck
Name:Tyrosine-protein kinase Lck
Type:n/a
Mol. Mass.:57987.83
Organism:Homo sapiens (Human)
Description:P06239
Residue:509
BDBM8807
NameBDBM8807
Synonyms:CHEMBL43773 Pyrazolo[3,4-d]pyrimidine 15
TypeSmall organic molecule
Emp. Form.C32H36N8O3
Mol. Mass.580.68
SMILESCOc1cc(ccc1NC(=O)c1cc2ccccc2o1)-c1nn([C@H]2CC[C@@H](CC2)N2CCN(C)CC2)c2ncnc(N)c12